{"text_format":"1","workbook":"xlsx","n_sheets":3,"sheets":["FORMULIER","Retour","BRONDATA"],"not_rendered":{"charts":0,"images":0,"macros":1,"external_links":0,"defined_names":0,"comments":0,"pivot_tables":0},"unopened":[],"bounds":{"document_bytes":16777216,"sheet_cells":100000,"rows_first":2000,"rows_last":500,"rows_between":2000,"halvings":0,"cell_chars":16384,"cell_head_chars":4096},"cells_cut":0,"cells_raw":0,"read":"whole","date_system":"1900"}

{"sheet":"FORMULIER","index":0,"n_rows":48,"n_cols":7,"rows_kept":48,"cut":false,"hidden":false,"merged":[[6,1,6,6],[8,1,8,6],[9,1,9,6],[1,1,1,6]]}
[]
[null,"Financieel verantwoordingsformulier LEKP 2023-2024"]
[]
[null,"Selecteer uw gemeente:","HOOGSTRATEN",null,null,"Cofinancieringsdrempel:"]
[null,"KBO-nummer:",{"$f":"IFERROR(VLOOKUP(C4,Tabel2[[Gemeente]:[KBO]],2,FALSE),\"\")","v":"0207502202"},null,null,{"$f":"IFERROR(VLOOKUP(C4,Tabel2[#All],7,FALSE),\"Selecteer eerst uw gemeente\")","v":173876.72}]
[]
[null,"Gelieve in onderstaande tabel alle acties in het kader van de LEKP-doelstellingen die in 2023 en 2024 werden uitgevoerd te registreren. Kies per actie uit de keuzelijst op welke doelstelling en welk jaar de actie betrekking heeft en vervolgens de uitgave van deze actie. Geef ten slotte een korte toelichting bij elke uitgave. Optioneel is het mogelijk om een verwijzing naar de interne boekhouding van de gemeente toe te voegen."]
[]
[null,"(!) Opgelet! Als een actie betrekking heeft op meerdere LEKP-doelstellingen, gelieve dan in het dropdown-menu alle doelstellingen te selecteren waarop de actie betrekking heeft. Dit doe je door het drop-downmenu telkens te openen en een andere doelstelling aan te klikken. \n"]
[null,"(!) Opgelet! Onder de doelstelling 'Andere' horen geen acties die niets te maken hebben met de LEKP-doelstellingen."]
[]
[null,"Naam actie","LEKP-Doelstellling","Jaar","Uitgave (€)","Toelichting bij uitgave","Referentie boekhouding"]
[null,"Studiewerk warmtenet Stede Akkers","Coöperatieve hernieuwbare energieprojecten",2024,35090,"Expertise, advies en studiewerk rond partnerschap en businesscase warmtenet stede akkers met restwarmte","Actie 4/1/1/3"]
[null,"Trajectbegeleiding warmtenet Stede Akkers","Coöperatieve hernieuwbare energieprojecten",2024,7480,"Begeleiding en expertise rond partnerschap en businesscase warmtenetten, waaronder Stede Akkers met restwarmte en potentieel Thermische energie uit drinkwater","Actie 4/1/1/3"]
[null,"Vier deelwagens","Deelwagens",2024,33976.800000000003,"Introductie van vier deelwagens in Hoogstraten","Actie 3/2/1/1"]
[null,"Laadpalen ","Laadpunten",2024,20029.53,"Vijf laadpunten, voor oa de deelwagens en op eigen terrein (open voor burgers)","Actie 3/2/1/1"]
[null,"Tiny forests","Natuurgroenperken",2024,13400,"Samenwerking voor de aanplant van twee tiny forests ","Actie 3/2/2/1"]
[null,"Energiemaatregelen stadsgebouwen","Reductie CO2 uitstoot lokaal patrimonium",2024,873494,"Energiebesparende maatregelen volgens het vastgoedplan; dakisolatie, PV panelen, relighting,…","Actie 4/1/2/1"]
[null,"Verledding openbare verlichting","VerLEDding",2024,162980,"Verledding van de openbare verlichting, status: 56%","actie 4/1/2/2"]
[null,"Vastgoedplan","Reductie CO2 uitstoot lokaal patrimonium",2024,14723.28,"Begeleiding bij de opmaak van een strategische vastgoedplan (eindfase)","actie 4/1/2/1"]
[null,"Huisbezoeker woonloket","Personeelskosten",2024,56547.98,"Huisbezoeken en groepsactiviteiten voor gezinnen ivm energiebesparing en hernieuwbare energie","Actie 1/2/3/1"]
[null,"Beveiligen fietsroutes en doorsteken","Fietspaden",2024,39264.449999999997,"Beveiligen van fietsroutes en doorsteken door oa scheiden van verkeersstromen en meer ruimte te maken aan oversteken. ","Actie 1/3/2/1"]
[]
[]
[]
[]
[]
[]
[]
[]
[]
[]
[]
[]
[]
[]
[]
[]
[]
[]
[]
[]
[]
[]
[null,null,null,null,null,"Cofinancieringscheck:"]
[null,"TOTAAL",null,null,{"$f":"SUM(E13:E43)","v":1256986.04},{"$f":"IFERROR(IF(E46>VLOOKUP(C4,Tabel2[#All],7,FALSE), \"OK\", \"NIET OK\"),\"\")","v":"OK"}]
[]
[null,{"$f":"IFERROR(IF(F46=\"OK\", \"U heeft voor de LEKP-subsidie voldoende uitgaven verantwoord om aan de cofinancieringsvoorwaarde te voldoen\",\"! Opgelet: u heeft voor de LEKP-subsidie TE WEINIG uitgaven verantwoord om aan de cofinancieringsvolwaarde te voldoen.\"),\"\")","v":"U heeft voor de LEKP-subsidie voldoende uitgaven verantwoord om aan de cofinancieringsvoorwaarde te voldoen"}]

{"sheet":"Retour","index":1,"n_rows":39,"n_cols":25,"rows_kept":39,"cut":false,"hidden":true,"merged":[]}
[]
[null,"GEMEENTE",{"$f":"+FORMULIER!C4","v":"HOOGSTRATEN"},null,null,"Trekkingsrecht:",{"$f":"VLOOKUP(FORMULIER!C4,BRONDATA!$F$3:$L$296,6,FALSE)","v":86938.36}]
[]
[null,"LEKP - DOELSTELLINGEN","Totaal uitgaven","Uitgaven 2023","Uitgaven 2024","Aandeel (%)","Hefboomeffect"]
[null,"WERF 1: Vergroening",{"$f":"SUM(D5:E5)","v":13400},{"$f":"SUM(D6:D8)","v":0},{"$f":"SUM(E6:E8)","v":13400},{"$f":"IFERROR(C5/$C$36,0)","v":1.0660420699660276E-2},{"$f":"C5/$G$2","v":0.15413219204963149}]
[null,"Bomen",{"$f":"SUMIF(Tabel811[[#All],[LEKP-Doelstellling]],BRONDATA!B3,Tabel811[[#All],[Uitgave (€)]])","v":0},{"$f":"SUMIFS(Tabel811[[#All],[Uitgave (€)]],Tabel811[[#All],[Jaar]],\"2023\",Tabel811[[#All],[LEKP-Doelstellling]],BRONDATA!B3)","v":0},{"$f":"SUMIFS(Tabel811[[#All],[Uitgave (€)]],Tabel811[[#All],[Jaar]],\"2024\",Tabel811[[#All],[LEKP-Doelstellling]],BRONDATA!B3)","v":0},{"$f":"IFERROR(C6/$C$36,0)","v":0},{"$f":"C6/$G$2","v":0}]
[null,"Hagen en Geveltuinbeplanting",{"$f":"SUMIF(Tabel811[[#All],[LEKP-Doelstellling]],BRONDATA!B4,Tabel811[[#All],[Uitgave (€)]])","v":0},{"$f":"SUMIFS(Tabel811[[#All],[Uitgave (€)]],Tabel811[[#All],[Jaar]],\"2023\",Tabel811[[#All],[LEKP-Doelstellling]],BRONDATA!B4)","v":0},{"$f":"SUMIFS(Tabel811[[#All],[Uitgave (€)]],Tabel811[[#All],[Jaar]],\"2024\",Tabel811[[#All],[LEKP-Doelstellling]],BRONDATA!B4)","v":0},{"$f":"IFERROR(C7/$C$36,0)","v":0},{"$f":"C7/$G$2","v":0}]
[null,"Natuurgroenperken",{"$f":"SUMIF(Tabel811[[#All],[LEKP-Doelstellling]],BRONDATA!B5,Tabel811[[#All],[Uitgave (€)]])","v":13400},{"$f":"SUMIFS(Tabel811[[#All],[Uitgave (€)]],Tabel811[[#All],[Jaar]],\"2023\",Tabel811[[#All],[LEKP-Doelstellling]],BRONDATA!B5)","v":0},{"$f":"SUMIFS(Tabel811[[#All],[Uitgave (€)]],Tabel811[[#All],[Jaar]],\"2024\",Tabel811[[#All],[LEKP-Doelstellling]],BRONDATA!B5)","v":13400},{"$f":"IFERROR(C8/$C$36,0)","v":1.0660420699660276E-2},{"$f":"C8/$G$2","v":0.15413219204963149}]
[]
[null,"WERF 2: Verrijk je wijk",{"$f":"SUM(D10:E10)","v":42570},{"$f":"SUM(D11:D15)","v":0},{"$f":"SUM(E11:E15)","v":42570},{"$f":"IFERROR(C10/$C$36,0)","v":3.3866724566010295E-2},{"$f":"C10/$G$2","v":0.48965726981737406}]
[null,"Collectief georganiseerde energiebesparende renovaties",{"$f":"SUM(D11:E11)","v":0},{"$f":"SUMIFS(Tabel811[[#All],[Uitgave (€)]],Tabel811[[#All],[Jaar]],\"2023\",Tabel811[[#All],[LEKP-Doelstellling]],BRONDATA!B6)","v":0},{"$f":"SUMIFS(Tabel811[[#All],[Uitgave (€)]],Tabel811[[#All],[Jaar]],\"2024\",Tabel811[[#All],[LEKP-Doelstellling]],BRONDATA!B6)","v":0},0,0]
[null,"coöperatieve/participatieve hernieuwbare energieprojecten",{"$f":"SUM(D12:E12)","v":42570},{"$f":"SUMIFS(Tabel811[[#All],[Uitgave (€)]],Tabel811[[#All],[Jaar]],\"2023\",Tabel811[[#All],[LEKP-Doelstellling]],BRONDATA!B7)","v":0},{"$f":"SUMIFS(Tabel811[[#All],[Uitgave (€)]],Tabel811[[#All],[Jaar]],\"2024\",Tabel811[[#All],[LEKP-Doelstellling]],BRONDATA!B7)","v":42570},3.3866724566010295E-2,0.48965726981737406]
[null,"Energiegemeenschappen",0,{"$f":"SUMIFS(Tabel811[[#All],[Uitgave (€)]],Tabel811[[#All],[Jaar]],\"2023\",Tabel811[[#All],[LEKP-Doelstellling]],BRONDATA!B8)","v":0},{"$f":"SUMIFS(Tabel811[[#All],[Uitgave (€)]],Tabel811[[#All],[Jaar]],\"2024\",Tabel811[[#All],[LEKP-Doelstellling]],BRONDATA!B8)","v":0},0,0]
[null,"Klimaattafels",0,{"$f":"SUMIFS(Tabel811[[#All],[Uitgave (€)]],Tabel811[[#All],[Jaar]],\"2023\",Tabel811[[#All],[LEKP-Doelstellling]],BRONDATA!B9)","v":0},{"$f":"SUMIFS(Tabel811[[#All],[Uitgave (€)]],Tabel811[[#All],[Jaar]],\"2024\",Tabel811[[#All],[LEKP-Doelstellling]],BRONDATA!B9)","v":0},0,0]
[null,"Wijkverbeteringscontract",0,{"$f":"SUMIFS(Tabel811[[#All],[Uitgave (€)]],Tabel811[[#All],[Jaar]],\"2023\",Tabel811[[#All],[LEKP-Doelstellling]],BRONDATA!B19)","v":0},{"$f":"SUMIFS(Tabel811[[#All],[Uitgave (€)]],Tabel811[[#All],[Jaar]],\"2024\",Tabel811[[#All],[LEKP-Doelstellling]],BRONDATA!B19)","v":0},0,0]
[]
[null,"WERF 3: Mobiliteit",{"$f":"SUM(D17:E17)","v":93270.78},{"$f":"SUM(D18:D20)","v":0},93270.78,{"$f":"IFERROR(C17/$C$36,0)","v":7.4201921924288039E-2},{"$f":"C17/$G$2","v":1.0728380429536513}]
[null,"Deelwagens",{"$f":"SUM(D18:E18)","v":33976.800000000003},{"$f":"SUMIFS(Tabel811[[#All],[Uitgave (€)]],Tabel811[[#All],[Jaar]],\"2023\",Tabel811[[#All],[LEKP-Doelstellling]],BRONDATA!B10)","v":0},{"$f":"SUMIFS(Tabel811[[#All],[Uitgave (€)]],Tabel811[[#All],[Jaar]],\"2024\",Tabel811[[#All],[LEKP-Doelstellling]],BRONDATA!B10)","v":33976.800000000003},{"$f":"IFERROR(C18/$C$36,0)","v":2.7030371793150543E-2},{"$f":"C18/$G$2","v":0.39081482558447161}]
[null,"Fietspaden",{"$f":"SUM(D19:E19)","v":39264.449999999997},{"$f":"SUMIFS(Tabel811[[#All],[Uitgave (€)]],Tabel811[[#All],[Jaar]],\"2023\",Tabel811[[#All],[LEKP-Doelstellling]],BRONDATA!B11)","v":0},{"$f":"SUMIFS(Tabel811[[#All],[Uitgave (€)]],Tabel811[[#All],[Jaar]],\"2024\",Tabel811[[#All],[LEKP-Doelstellling]],BRONDATA!B11)","v":39264.449999999997},{"$f":"IFERROR(C19/$C$36,0)","v":3.1236981756774321E-2},{"$f":"C19/$G$2","v":0.45163550359128002}]
[null,"Laadpunten",20029.53,{"$f":"SUMIFS(Tabel811[[#All],[Uitgave (€)]],Tabel811[[#All],[Jaar]],\"2023\",Tabel811[[#All],[LEKP-Doelstellling]],BRONDATA!B12)","v":0},{"$f":"SUMIFS(Tabel811[[#All],[Uitgave (€)]],Tabel811[[#All],[Jaar]],\"2024\",Tabel811[[#All],[LEKP-Doelstellling]],BRONDATA!B12)","v":20029.53},{"$f":"IFERROR(C20/$C$36,0)","v":1.5934568374363169E-2},{"$f":"C20/$G$2","v":0.23038771377789963}]
[]
[null,"WERF 4: Droogte",{"$f":"SUM(D22:E22)","v":0},{"$f":"SUM(D23:D24)","v":0},{"$f":"SUM(E23:E24)","v":0},{"$f":"IFERROR(C22/$C$36,0)","v":0},{"$f":"C22/$G$2","v":0}]
[null,"Hemelwateropvang",{"$f":"SUM(D23:E23)","v":0},{"$f":"SUMIFS(Tabel811[[#All],[Uitgave (€)]],Tabel811[[#All],[Jaar]],\"2023\",Tabel811[[#All],[LEKP-Doelstellling]],BRONDATA!B13)","v":0},{"$f":"SUMIFS(Tabel811[[#All],[Uitgave (€)]],Tabel811[[#All],[Jaar]],\"2024\",Tabel811[[#All],[LEKP-Doelstellling]],BRONDATA!B13)","v":0},{"$f":"IFERROR(C23/$C$36,0)","v":0},{"$f":"C23/$G$2","v":0}]
[null,"Ontharding",{"$f":"SUM(D24:E24)","v":0},{"$f":"SUMIFS(Tabel811[[#All],[Uitgave (€)]],Tabel811[[#All],[Jaar]],\"2023\",Tabel811[[#All],[LEKP-Doelstellling]],BRONDATA!B14)","v":0},{"$f":"SUMIFS(Tabel811[[#All],[Uitgave (€)]],Tabel811[[#All],[Jaar]],\"2024\",Tabel811[[#All],[LEKP-Doelstellling]],BRONDATA!B14)","v":0},{"$f":"IFERROR(C24/$C$36,0)","v":0},{"$f":"C24/$G$2","v":0}]
[]
[null,"ALGEMENE DOELSTELLINGEN",{"$f":"SUM(D26:E26)","v":1051197.28},{"$f":"SUM(D27:D30)","v":0},{"$f":"SUM(E27:E30)","v":1051197.28},{"$f":"IFERROR(C26/$C$36,0)","v":0.83628397336855065},{"$f":"C26/$G$2","v":12.091294107687332}]
[null,"VerLEDding",{"$f":"SUM(D27:E27)","v":162980},{"$f":"SUMIFS(Tabel811[[#All],[Uitgave (€)]],Tabel811[[#All],[Jaar]],\"2023\",Tabel811[[#All],[LEKP-Doelstellling]],BRONDATA!B18)","v":0},{"$f":"SUMIFS(Tabel811[[#All],[Uitgave (€)]],Tabel811[[#All],[Jaar]],\"2024\",Tabel811[[#All],[LEKP-Doelstellling]],BRONDATA!B18)","v":162980},{"$f":"IFERROR(C27/$C$36,0)","v":0.12965935564407699},1.8746615418096224]
[null,"Lokaal warmte- en sloopbeleid",{"$f":"SUM(D28:E28)","v":0},{"$f":"SUMIFS(Tabel811[[#All],[Uitgave (€)]],Tabel811[[#All],[Jaar]],\"2023\",Tabel811[[#All],[LEKP-Doelstellling]],BRONDATA!B16)","v":0},{"$f":"SUMIFS(Tabel811[[#All],[Uitgave (€)]],Tabel811[[#All],[Jaar]],\"2024\",Tabel811[[#All],[LEKP-Doelstellling]],BRONDATA!B16)","v":0},{"$f":"IFERROR(C28/$C$36,0)","v":0},0]
[null,"Reductie CO2 uitstoot lokaal patrimonium",888217.28,{"$f":"SUMIFS(Tabel811[[#All],[Uitgave (€)]],Tabel811[[#All],[Jaar]],\"2023\",Tabel811[[#All],[LEKP-Doelstellling]],BRONDATA!B17)","v":0},{"$f":"SUMIFS(Tabel811[[#All],[Uitgave (€)]],Tabel811[[#All],[Jaar]],\"2024\",Tabel811[[#All],[LEKP-Doelstellling]],BRONDATA!B17)","v":888217.28},{"$f":"IFERROR(C29/$C$36,0)","v":0.70662461772447371},10.21663256587771]
[null,"Energiebespraring lokaal patrimonium",0,{"$f":"SUMIFS(Tabel811[[#All],[Uitgave (€)]],Tabel811[[#All],[Jaar]],\"2023\",Tabel811[[#All],[LEKP-Doelstellling]],BRONDATA!B15)","v":0},{"$f":"SUMIFS(Tabel811[[#All],[Uitgave (€)]],Tabel811[[#All],[Jaar]],\"2024\",Tabel811[[#All],[LEKP-Doelstellling]],BRONDATA!B15)","v":0},{"$f":"IFERROR(C30/$C$36,0)","v":0},0]
[]
[null,"Personeelskosten",{"$f":"SUM(D32:E32)","v":56547.98},{"$f":"SUMIFS(Tabel811[[#All],[Uitgave (€)]],Tabel811[[#All],[Jaar]],\"2023\",Tabel811[[#All],[LEKP-Doelstellling]],BRONDATA!B20)","v":0},{"$f":"SUMIFS(Tabel811[[#All],[Uitgave (€)]],Tabel811[[#All],[Jaar]],\"2024\",Tabel811[[#All],[LEKP-Doelstellling]],BRONDATA!B20)","v":56547.98},{"$f":"IFERROR(C32/C36,0)","v":4.4986959441490698E-2},{"$f":"C32/G2","v":0.65043762040139708}]
[]
[null,"ANDERE/GECOMBINEERDE UITGAVEN",{"$f":"C36-SUM(C5,C10,C17,C22,C26,C32)","v":0},0,{"$f":"E36-SUM(E5,E10,E17,E22,E26,E32)","v":0},{"$f":"IFERROR(C34/$C$36,0)","v":0},{"$f":"C34/$G$2","v":0}]
[]
[null,"TOTAAL",{"$f":"FORMULIER!E46","v":1256986.04},{"$f":"SUMIF(Tabel811[[#All],[Jaar]],\"2023\",Tabel811[[#All],[Uitgave (€)]])","v":0},{"$f":"SUMIF(Tabel811[[#All],[Jaar]],\"2024\",Tabel811[[#All],[Uitgave (€)]])","v":1256986.04},{"$f":"IFERROR(C36/$C$36,0)","v":1},{"$f":"C36/$G$2","v":14.458359232909386}]
[]
["Exportdata:"]
[null,{"$f":"C2","v":"HOOGSTRATEN"},{"$f":"G2","v":86938.36},{"$f":"C36","v":1256986.04},{"$f":"D36","v":0},{"$f":"E36","v":1256986.04},{"$f":"E6","v":0},{"$f":"E7","v":0},{"$f":"E8","v":13400},{"$f":"E11","v":0},{"$f":"E12","v":42570},{"$f":"E13","v":0},{"$f":"E14","v":0},{"$f":"E15","v":0},{"$f":"E18","v":33976.800000000003},{"$f":"E19","v":39264.449999999997},{"$f":"E20","v":20029.53},{"$f":"E23","v":0},{"$f":"E24","v":0},{"$f":"E27","v":162980},{"$f":"E28","v":0},{"$f":"E29","v":888217.28},{"$f":"E30","v":0},{"$f":"E32","v":56547.98},{"$f":"E34","v":0}]

{"sheet":"BRONDATA","index":2,"n_rows":296,"n_cols":16,"rows_kept":296,"cut":false,"hidden":true,"merged":[]}
[]
["Werf","Doelstelling",null,null,null,"Gemeente","KBO","1.0","2.0","2.1","TOTAAL","CofinDrempel",null,null,null,"Jaar"]
["WERF 1","Bomen",null,null,null,"AALST","0207437468",388048.8,135053.62,224849.83,747952.25,{"$f":"Tabel2[[#This Row],[TOTAAL]]*2","v":1495904.5},null,null,null,2023]
["WERF 1","Hagen en Geveltuinbeplanting",null,null,null,"AALTER","0697608063",113128.71,39372.480000000003,66090.36,218591.55,{"$f":"Tabel2[[#This Row],[TOTAAL]]*2","v":437183.1},null,null,null,2024]
["WERF 1","Natuurgroenperken",null,null,null,"AARSCHOT","0207515464",122953.53,0,0,122953.53,{"$f":"Tabel2[[#This Row],[TOTAAL]]*2","v":245907.06}]
["WERF 2","Collectief georganiseerde energiebesparende renovaties",null,null,null,"AARTSELAAR","0207508932",54179.38,18856.189999999999,0,73035.569999999992,{"$f":"Tabel2[[#This Row],[TOTAAL]]*2","v":146071.13999999998}]
["WERF 2","Coöperatieve hernieuwbare energieprojecten",null,null,null,"AFFLIGEM","0207509031",50383.1,0,0,50383.1,{"$f":"Tabel2[[#This Row],[TOTAAL]]*2","v":100766.2}]
["WERF 2","Energiegemeenschappen",null,null,null,"ALKEN","0207474882",44792.639999999999,15589.3,0,60381.94,{"$f":"Tabel2[[#This Row],[TOTAAL]]*2","v":120763.88}]
["WERF 2","Klimaattafels",null,null,null,"ANTWERPEN","0207500123",3305227.7,1150326.8999999999,1929832.62,6385387.2199999997,{"$f":"Tabel2[[#This Row],[TOTAAL]]*2","v":12770774.439999999}]
["WERF 3","Deelwagens",null,null,null,"ANZEGEM","0207484780",57776.01,20107.93,0,77883.94,{"$f":"Tabel2[[#This Row],[TOTAAL]]*2","v":155767.88}]
["WERF 3","Fietspaden",null,null,null,"ARDOOIE","0216771046",35627.53,0,0,35627.53,{"$f":"Tabel2[[#This Row],[TOTAAL]]*2","v":71255.06}]
["WERF 3","Laadpunten",null,null,null,"ARENDONK","0207505368",52686.43,18336.59,30760.71,101783.73000000001,{"$f":"Tabel2[[#This Row],[TOTAAL]]*2","v":203567.46000000002}]
["WERF 4","Hemelwateropvang voor infiltratie, buffering of hergebruik",null,null,null,"AS","0207465083",32308.82,11244.52,0,43553.34,{"$f":"Tabel2[[#This Row],[TOTAAL]]*2","v":87106.68}]
["WERF 4","Ontharding",null,null,null,"ASSE","0207506259",132448.67000000001,46096.45,75915.62,254460.74,{"$f":"Tabel2[[#This Row],[TOTAAL]]*2","v":508921.48}]
["AD","Energiebesparing lokaal patrimonium",null,null,null,"ASSENEDE","0207447861",57235.54,19919.830000000002,33347.31,110502.68,{"$f":"Tabel2[[#This Row],[TOTAAL]]*2","v":221005.36}]
["AD","Lokaal warmte- en sloopbeleid",null,null,null,"AVELGEM","0207485770",40381.800000000003,0,0,40381.800000000003,{"$f":"Tabel2[[#This Row],[TOTAAL]]*2","v":80763.600000000006}]
["AD","Reductie CO2 uitstoot lokaal patrimonium",null,null,null,"BAARLE-HERTOG","0207509427",11926.7,4150.88,0,16077.580000000002,{"$f":"Tabel2[[#This Row],[TOTAAL]]*2","v":32155.160000000003}]
["AD","VerLEDding",null,null,null,"BALEN","0207537042",88833.44,30916.93,0,119750.37,{"$f":"Tabel2[[#This Row],[TOTAAL]]*2","v":239500.74}]
["AD","Wijkverbeteringscontracten",null,null,null,"BEERNEM","0207527936",62206.42,0,0,62206.42,{"$f":"Tabel2[[#This Row],[TOTAAL]]*2","v":124412.84}]
[null,"Personeelskosten",null,null,null,"BEERSE","0207505764",69926.27,24336.62,40561.67,134824.56,{"$f":"Tabel2[[#This Row],[TOTAAL]]*2","v":269649.12}]
[null,"Andere",null,null,null,"BEERSEL","0207506358",96634.37,33631.910000000003,56079.34,186345.62,{"$f":"Tabel2[[#This Row],[TOTAAL]]*2","v":372691.24}]
[null,null,null,null,null,"BEGIJNENDIJK","0207516058",39386.400000000001,0,0,39386.400000000001,{"$f":"Tabel2[[#This Row],[TOTAAL]]*2","v":78772.800000000003}]
[null,null,null,null,null,"BEKKEVOORT","0207516157",25286.75,8800.61,0,34087.360000000001,{"$f":"Tabel2[[#This Row],[TOTAAL]]*2","v":68174.720000000001}]
[null,null,null,null,null,"BERINGEN","0207465281",184281.17,64135.85,107463.29,355880.31,{"$f":"Tabel2[[#This Row],[TOTAAL]]*2","v":711760.62}]
[null,null,null,null,null,"BERLAAR","0207537339",45205,15732.81,26475.18,87412.989999999991,{"$f":"Tabel2[[#This Row],[TOTAAL]]*2","v":174825.97999999998}]
[null,null,null,null,null,"BERLARE","0207445485",58947.040000000001,20515.490000000002,0,79462.53,{"$f":"Tabel2[[#This Row],[TOTAAL]]*2","v":158925.06}]
[null,null,null,null,null,"BERTEM","0207516256",38400.949999999997,0,0,38400.949999999997,{"$f":"Tabel2[[#This Row],[TOTAAL]]*2","v":76801.899999999994}]
[null,null,null,null,null,"BEVER","0207539616",9095.44,0,0,9095.44,{"$f":"Tabel2[[#This Row],[TOTAAL]]*2","v":18190.88}]
[null,null,null,null,null,"BEVEREN","0207462313",189379.72,65910.31,0,255290.03,{"$f":"Tabel2[[#This Row],[TOTAAL]]*2","v":510580.06}]
[null,null,null,null,null,"BIERBEEK","0207516454",38902.559999999998,0,0,38902.559999999998,{"$f":"Tabel2[[#This Row],[TOTAAL]]*2","v":77805.119999999995}]
[null,null,null,null,null,"BILZEN","0207475377",127143.38,44250.04,0,171393.42,{"$f":"Tabel2[[#This Row],[TOTAAL]]*2","v":342786.84}]
[null,null,null,null,null,"BLANKENBERGE","0206684927",83428.77,29035.93,48971.81,161436.51,{"$f":"Tabel2[[#This Row],[TOTAAL]]*2","v":322873.02}]
[null,null,null,null,null,"BOCHOLT","0207471518",54066.05,18816.75,0,72882.8,{"$f":"Tabel2[[#This Row],[TOTAAL]]*2","v":145765.6}]
[null,null,null,null,null,"BOECHOUT","0207536448",52198.05,18166.62,0,70364.67,{"$f":"Tabel2[[#This Row],[TOTAAL]]*2","v":140729.34}]
[null,null,null,null,null,"BONHEIDEN","0207534171",57106.54,19874.939999999999,33178.879999999997,110160.35999999999,{"$f":"Tabel2[[#This Row],[TOTAAL]]*2","v":220320.71999999997}]
[null,null,null,null,null,"BOOM","0207506952",75658.240000000005,26331.53,0,101989.77,{"$f":"Tabel2[[#This Row],[TOTAAL]]*2","v":203979.54}]
[null,null,null,null,null,"BOORTMEERBEEK","0207516751",47917.75,16676.939999999999,27481.91,92076.6,{"$f":"Tabel2[[#This Row],[TOTAAL]]*2","v":184153.2}]
[null,null,null,null,null,"BORGLOON","0206914361",44525.120000000003,15496.19,0,60021.310000000005,{"$f":"Tabel2[[#This Row],[TOTAAL]]*2","v":120042.62000000001}]
[null,null,null,null,null,"BORNEM","0207500420",82838.179999999993,28830.38,0,111668.56,{"$f":"Tabel2[[#This Row],[TOTAAL]]*2","v":223337.12}]
[null,null,null,null,null,"BORSBEEK","0207509229",43976.18,15305.14,25410.35,84691.67,{"$f":"Tabel2[[#This Row],[TOTAAL]]*2","v":169383.34}]
[null,null,null,null,null,"BOUTERSEM","0207516949",31965.56,11125.06,0,43090.62,{"$f":"Tabel2[[#This Row],[TOTAAL]]*2","v":86181.24}]
[null,null,null,null,null,"BRASSCHAAT","0206677801",143620.64000000001,49984.66,0,193605.30000000002,{"$f":"Tabel2[[#This Row],[TOTAAL]]*2","v":387210.60000000003}]
[null,null,null,null,null,"BRECHT","0207500321",115242.16,40108.03,0,155350.19,{"$f":"Tabel2[[#This Row],[TOTAAL]]*2","v":310700.38}]
[null,null,null,null,null,"BREDENE","0207435092",72382.8,0,0,72382.8,{"$f":"Tabel2[[#This Row],[TOTAAL]]*2","v":144765.6}]
[null,null,null,null,null,"BREE","0207471617",64924.08,22595.69,37550.67,125070.44,{"$f":"Tabel2[[#This Row],[TOTAAL]]*2","v":250140.88}]
[null,null,null,null,null,"BRUGGE","0207528035",571637.61,198948.51,334241.90000000002,1104828.02,{"$f":"Tabel2[[#This Row],[TOTAAL]]*2","v":2209656.04}]
[null,null,null,null,null,"BUGGENHOUT","0207445287",55865.08,0,0,55865.08,{"$f":"Tabel2[[#This Row],[TOTAAL]]*2","v":111730.16}]
[null,null,null,null,null,"DAMME","0207528134",43931.55,15289.61,25539.75,84760.91,{"$f":"Tabel2[[#This Row],[TOTAAL]]*2","v":169521.82}]
[null,null,null,null,null,"DE HAAN","0216770848",50697.61,0,0,50697.61,{"$f":"Tabel2[[#This Row],[TOTAAL]]*2","v":101395.22}]
[null,null,null,null,null,"DE PANNE","0207434597",43315.25,15075.12,0,58390.37,{"$f":"Tabel2[[#This Row],[TOTAAL]]*2","v":116780.74}]
[null,null,null,null,null,"DE PINTE","0207450534",40721.599999999999,14172.44,23737.52,78631.56,{"$f":"Tabel2[[#This Row],[TOTAAL]]*2","v":157263.12}]
[null,null,null,null,null,"DEERLIJK","0207488443",46863.94,16310.18,27114.52,90288.639999999999,{"$f":"Tabel2[[#This Row],[TOTAAL]]*2","v":180577.28}]
[null,null,null,null,null,"DEINZE","0697608162",177354.14,61725.02,103000.34,342079.5,{"$f":"Tabel2[[#This Row],[TOTAAL]]*2","v":684159}]
[null,null,null,null,null,"DENDERLEEUW","0207439745",80278.039999999994,27939.37,0,108217.40999999999,{"$f":"Tabel2[[#This Row],[TOTAAL]]*2","v":216434.81999999998}]
[null,null,null,null,null,"DENDERMONDE","0207445584",188007.13,65432.6,109263.32,362703.05000000005,{"$f":"Tabel2[[#This Row],[TOTAAL]]*2","v":725406.10000000009}]
[null,null,null,null,null,"DENTERGEM","0207434203",33729.9,0,0,33729.9,{"$f":"Tabel2[[#This Row],[TOTAAL]]*2","v":67459.8}]
[null,null,null,null,null,"DESSEL","0207536943",37423.26,13024.51,0,50447.770000000004,{"$f":"Tabel2[[#This Row],[TOTAAL]]*2","v":100895.54000000001}]
[null,null,null,null,null,"DESTELBERGEN","0207450633",69958.759999999995,0,0,69958.759999999995,{"$f":"Tabel2[[#This Row],[TOTAAL]]*2","v":139917.51999999999}]
[null,null,null,null,null,"DIEPENBEEK","0207465974",76834.100000000006,26740.77,0,103574.87000000001,{"$f":"Tabel2[[#This Row],[TOTAAL]]*2","v":207149.74000000002}]
[null,null,null,null,null,"DIEST","0207517345",99863.32,0,0,99863.32,{"$f":"Tabel2[[#This Row],[TOTAAL]]*2","v":199726.64}]
{"$rows_left_out":236}